{"text_format":"1","workbook":"xlsx","n_sheets":3,"sheets":["請求書","商品コード","Sheet3"],"not_rendered":{"charts":0,"images":0,"macros":1,"external_links":0,"defined_names":0,"comments":0,"pivot_tables":0},"unopened":[],"bounds":{"document_bytes":16777216,"sheet_cells":100000,"rows_first":2000,"rows_last":500,"rows_between":2000,"halvings":0,"cell_chars":16384,"cell_head_chars":4096},"cells_cut":0,"cells_raw":0,"read":"whole","date_system":"1900"}

{"sheet":"請求書","index":0,"n_rows":17,"n_cols":6,"rows_kept":17,"cut":false,"hidden":false,"merged":[[0,2,0,3],[5,0,5,5],[14,2,14,3],[15,2,15,3],[16,2,16,3]]}
[null,null,"ご　請　求　書",null,null,{"$f":"TODAY()","v":"2015-12-31"}]
[]
[null,"御中",null,null,null,"和　弐　株式会社"]
["お客様コード",null,null,null,null,"〒530-****　大阪市北区○○1-2-3"]
[null,null,null,null,null,"TEL　06-637*-8282"]
["下記の通りご請求申し上げます。"]
[]
["商品コード","商品名","単価","数量","金額","納品日"]
[null,{"$f":"IF($A9=\"\",\"\",VLOOKUP($A9,商品コード!$A$2:$C$7,2))","v":""},{"$f":"IF($A9=\"\",\"\",VLOOKUP($A9,商品コード!$A$2:$C$7,3))","v":""},null,{"$f":"IF(D9=\"\",\"\",C9*D9)","v":""}]
[null,{"$f":"IF($A10=\"\",\"\",VLOOKUP($A10,商品コード!$A$2:$C$7,2))","v":""},{"$f":"IF($A10=\"\",\"\",VLOOKUP($A10,商品コード!$A$2:$C$7,3))","v":""},null,{"$f":"IF(D10=\"\",\"\",C10*D10)","v":""}]
[null,{"$f":"IF($A11=\"\",\"\",VLOOKUP($A11,商品コード!$A$2:$C$7,2))","v":""},{"$f":"IF($A11=\"\",\"\",VLOOKUP($A11,商品コード!$A$2:$C$7,3))","v":""},null,""]
[null,{"$f":"IF($A12=\"\",\"\",VLOOKUP($A12,商品コード!$A$2:$C$7,2))","v":""},{"$f":"IF($A12=\"\",\"\",VLOOKUP($A12,商品コード!$A$2:$C$7,3))","v":""},null,""]
[null,{"$f":"IF($A13=\"\",\"\",VLOOKUP($A13,商品コード!$A$2:$C$7,2))","v":""},{"$f":"IF($A13=\"\",\"\",VLOOKUP($A13,商品コード!$A$2:$C$7,3))","v":""},null,""]
[null,{"$f":"IF($A14=\"\",\"\",VLOOKUP($A14,商品コード!$A$2:$C$7,2))","v":""},{"$f":"IF($A14=\"\",\"\",VLOOKUP($A14,商品コード!$A$2:$C$7,3))","v":""},null,""]
[null,null,"合計金額",null,{"$f":"SUM(E9:E14)","v":0}]
[null,null,"消費税（8％）",null,{"$f":"E15*0.08","v":0}]
[null,null,"ご請求金額",null,{"$f":"E15+E16","v":0}]

{"sheet":"商品コード","index":1,"n_rows":7,"n_cols":3,"rows_kept":7,"cut":false,"hidden":false,"merged":[]}
["商品コード","商品名","単価"]
[1001,"ワニchanシャンプー",700]
[1002,"ワニchanリンス",700]
[1003,"ワニchanボディシャンプー",500]
[1004,"ワニchanローション",650]
[1005,"ワニchan乳液",650]
[1006,"ワニchanお試しセット",1000]

{"sheet":"Sheet3","index":2,"n_rows":0,"n_cols":0,"rows_kept":0,"cut":false,"hidden":false,"merged":[]}